Reaction Details
TargetSerine/threonine-protein kinase NIM1
LigandBDBM50327912
Substrate/Competitorn/a
Meas. Tech.ChEMBL_665081 (CHEMBL1260191)
IC50>10000±n/a nM
Citation Bindi, SFancelli, DAlli, CBerta, DBertrand, JACameron, ADCappella, PCarpinelli, PCervi, GCroci, VD'Anello, MForte, BGiorgini, MLMarsiglio, AMoll, JPesenti, EPittalà, VPulici, MRiccardi-Sirtori, FRoletto, FSoncini, CStorici, PVarasi, MVolpi, DZugnoni, PVianello, P Thieno[3,2-c]pyrazoles: a novel class of Aurora inhibitors with favorable antitumor activity. Bioorg Med Chem18:7113-20 (2010) 
 
Serine/threonine-protein kinase NIM1
Name:Serine/threonine-protein kinase NIM1
Type:PROTEIN
Mol. Mass.:49617.55
Organism:Homo sapiens (Human)
Description:ChEMBL_1510633
Residue:436
BDBM50327912
NameBDBM50327912
Synonyms:3-(4-Morpholin-4-yl-benzoylamino)-1H-thieno[3,2-c]pyrazole-5-carboxylic acid((S)-1-phenyl-2-pyrrolidin-1-yl-ethyl)-amide | CHEMBL1258913
TypeSmall organic molecule
Emp. Form.C29H32N6O3S
Mol. Mass.544.668
SMILESO=C(N[C@H](CN1CCCC1)c1ccccc1)c1cc2n[nH]c(NC(=O)c3ccc(cc3)N3CCOCC3)c2s1