Reaction Details
TargetPotassium voltage-gated channel subfamily H member 2
LigandBDBM50328878
Substrate/Competitorn/a
Meas. Tech.ChEMBL_673956 (CHEMBL1275133)
Ki 710±n/a nM
Citation Rankovic, ZCai, JKerr, JFradera, XRobinson, JMistry, AFinlay, WMcGarry, GAndrews, FCaulfield, WCumming, IDempster, MWaller, JArbuckle, WAnderson, MMartin, IMitchell, ALong, CBaugh, MWestwood, PKinghorn, EJones, PUitdehaag, JCvan Zeeland, MPotin, DSaniere, LFouquet, AChevallier, FDeronzier, HDorleans, CNicolai, E Optimisation of 2-cyano-pyrimidine inhibitors of cathepsin K: improving selectivity over hERG. Bioorg Med Chem Lett20:6237-41 (2010) 
 
Potassium voltage-gated channel subfamily H member 2
Name:Potassium voltage-gated channel subfamily H member 2
Type:Multi-pass membrane protein
Mol. Mass.:126672.65
Organism:Homo sapiens (Human)
Description:Q12809
Residue:1159
BDBM50328878
NameBDBM50328878
Synonyms:3-(2-cyano-6-propylpyrimidin-4-yl)-N-(2-(dimethylamino)ethyl)-N-methyl-5-(trifluoromethyl)benzamide | CHEMBL1271070
TypeSmall organic molecule
Emp. Form.C21H24F3N5O
Mol. Mass.419.4434
SMILESCCCc1cc(nc(n1)C#N)-c1cc(cc(c1)C(F)(F)F)C(=O)N(C)CCN(C)C