Reaction Details
TargetPotassium voltage-gated channel subfamily H member 2
LigandBDBM50313477
Substrate/Competitorn/a
Meas. Tech.ChEMBL_673956 (CHEMBL1275133)
Ki 320±n/a nM
Citation Rankovic, ZCai, JKerr, JFradera, XRobinson, JMistry, AFinlay, WMcGarry, GAndrews, FCaulfield, WCumming, IDempster, MWaller, JArbuckle, WAnderson, MMartin, IMitchell, ALong, CBaugh, MWestwood, PKinghorn, EJones, PUitdehaag, JCvan Zeeland, MPotin, DSaniere, LFouquet, AChevallier, FDeronzier, HDorleans, CNicolai, E Optimisation of 2-cyano-pyrimidine inhibitors of cathepsin K: improving selectivity over hERG. Bioorg Med Chem Lett20:6237-41 (2010) 
 
Potassium voltage-gated channel subfamily H member 2
Name:Potassium voltage-gated channel subfamily H member 2
Type:Multi-pass membrane protein
Mol. Mass.:126672.65
Organism:Homo sapiens (Human)
Description:Q12809
Residue:1159
BDBM50313477
NameBDBM50313477
Synonyms:4-(3-(pentan-3-ylamino)propyl)-6-(3-(trifluoromethyl)phenyl)pyrimidine-2-carbonitrile | CHEMBL1084401
TypeSmall organic molecule
Emp. Form.C20H23F3N4
Mol. Mass.376.4186
SMILESCCC(CC)NCCCc1cc(nc(n1)C#N)-c1cccc(c1)C(F)(F)F