Reaction Details
TargetPotassium voltage-gated channel subfamily H member 2
LigandBDBM50328886
Substrate/Competitorn/a
Meas. Tech.ChEMBL_673956 (CHEMBL1275133)
Ki 1000±n/a nM
Citation Rankovic, ZCai, JKerr, JFradera, XRobinson, JMistry, AFinlay, WMcGarry, GAndrews, FCaulfield, WCumming, IDempster, MWaller, JArbuckle, WAnderson, MMartin, IMitchell, ALong, CBaugh, MWestwood, PKinghorn, EJones, PUitdehaag, JCvan Zeeland, MPotin, DSaniere, LFouquet, AChevallier, FDeronzier, HDorleans, CNicolai, E Optimisation of 2-cyano-pyrimidine inhibitors of cathepsin K: improving selectivity over hERG. Bioorg Med Chem Lett20:6237-41 (2010) 
 
Potassium voltage-gated channel subfamily H member 2
Name:Potassium voltage-gated channel subfamily H member 2
Type:Multi-pass membrane protein
Mol. Mass.:126672.65
Organism:Homo sapiens (Human)
Description:Q12809
Residue:1159
BDBM50328886
NameBDBM50328886
Synonyms:4-(3-(4-methylpiperazin-1-yl)propyl)-6-(3-(trifluoromethyl)phenyl)pyrimidine-2-carbonitrile | CHEMBL1269848
TypeSmall organic molecule
Emp. Form.C20H22F3N5
Mol. Mass.389.4174
SMILESCN1CCN(CCCc2cc(nc(n2)C#N)-c2cccc(c2)C(F)(F)F)CC1