Reaction Details
TargetInhibitor of nuclear factor kappa-B kinase subunit beta
LigandBDBM50329197
Substrate/Competitorn/a
Meas. Tech.ChEMBL_674886 (CHEMBL1272515)
IC50>10±n/a nM
Citation Belanger, DBWilliams, MJCurran, PJMandal, AKMeng, ZRainka, MPYu, TShih, NYSiddiqui, MALiu, MTevar, SLee, SLiang, LGray, KYaremko, BJones, JSmith, EBPrelusky, DBBasso, AD Discovery of orally bioavailable imidazo[1,2-a]pyrazine-based Aurora kinase inhibitors. Bioorg Med Chem Lett20:6739-43 (2010) 
 
Inhibitor of nuclear factor kappa-B kinase subunit beta
Name:Inhibitor of nuclear factor kappa-B kinase subunit beta
Type:Serine/threonine-protein kinase
Mol. Mass.:86554.39
Organism:Homo sapiens (Human)
Description:GST-tagged IKK-2 was expressed in High Five cells and purified.
Residue:756
BDBM50329197
NameBDBM50329197
Synonyms:3-((R)-1-((2S,6R)-2,6-dimethylmorpholino)ethyl)-N-(6-methyl-3-(1H-pyrazol-4-yl)imidazo[1,2-a]pyrazin-8-yl)isothiazol-5-amine | CHEMBL1270399
TypeSmall organic molecule
Emp. Form.C21H26N8OS
Mol. Mass.438.549
SMILESC[C@@H](N1C[C@H](C)O[C@H](C)C1)c1cc(Nc2nc(C)cn3c(cnc23)-c2cn[nH]c2)sn1