Reaction Details
TargetVascular endothelial growth factor receptor 2
LigandBDBM50331030
Substrate/Competitorn/a
Meas. Tech.ChEMBL_684761 (CHEMBL1285788)
IC50 14±n/a nM
Citation Cho, TPDong, SYJun, FHong, FJLiang, YJLu, XHua, PJLi, LYLei, ZBing, HYing, ZQiong, LFBei, FBGuang, LLShen, GAHong, SGHong, SWTai, MX Novel potent orally active multitargeted receptor tyrosine kinase inhibitors: synthesis, structure-activity relationships, and antitumor activities of 2-indolinone derivatives. J Med Chem53:8140-9 (2010) 
 
Vascular endothelial growth factor receptor 2
Name:Vascular endothelial growth factor receptor 2
Type:Receptor Tyrosine Kinase
Mol. Mass.:151510.97
Organism:Homo sapiens (Human)
Description:P35968
Residue:1356
BDBM50331030
NameBDBM50331030
Synonyms:(Z)-5-(2-Diethylamino-ethyl)-2-(5-fluoro-2-oxo-1,2-dihydro-indol-3-ylidenemethyl)-3-methyl-5,6,7,8-tetrahydro-1H-pyrrolo[3,2-c]azepin-4-one | CHEMBL1276981
TypeSmall organic molecule
Emp. Form.C24H29FN4O2
Mol. Mass.424.5111
SMILESCCN(CC)CCN1CCCc2[nH]c(\C=C3/C(=O)Nc4ccc(F)cc34)c(C)c2C1=O