Reaction Details
Target11-beta-hydroxysteroid dehydrogenase 1
LigandBDBM50331363
Substrate/Competitorn/a
Meas. Tech.ChEMBL_687130 (CHEMBL1291707)
IC50 0.6±n/a nM
Citation Yan, XWang, ZSudom, ACardozo, MDeGraffenreid, MDi, YFan, PHe, XJaen, JCLabelle, MLiu, JMa, JMcMinn, DMiao, SSun, DTang, LTu, HUrsu, SWalker, NYe, QPowers, JP The synthesis and SAR of novel diarylsulfone 11ß-HSD1 inhibitors. Bioorg Med Chem Lett20:7071-5 (2010) 
 
11-beta-hydroxysteroid dehydrogenase 1
Name:11-beta-hydroxysteroid dehydrogenase 1
Type:Enzyme
Mol. Mass.:32409.16
Organism:Homo sapiens (Human)
Description:P28845
Residue:292
BDBM50331363
NameBDBM50331363
Synonyms:(S)-3'-cyclopropyl-4'-(4-(1,1,1-trifluoro-2-hydroxypropan-2-yl)phenylsulfonyl)biphenyl-4-carbonitrile | CHEMBL1289521
TypeSmall organic molecule
Emp. Form.C25H20F3NO3S
Mol. Mass.471.491
SMILESC[C@](O)(c1ccc(cc1)S(=O)(=O)c1ccc(cc1C1CC1)-c1ccc(cc1)C#N)C(F)(F)F