Reaction Details
TargetInsulin-like growth factor 1 receptor
LigandBDBM50336321
Substrate/Competitorn/a
Meas. Tech.ChEMBL_716595 (CHEMBL1670374)
IC50 5±n/a nM
Citation Jin, MKleinberg, ACooke, AGokhale, PCForeman, KDong, HSiu, KWBittner, MAMulvihill, KMYao, YLandfair, DO'Connor, MMak, GPachter, JAWild, RRosenfeld-Franklin, MJi, QMulvihill, MJ Potent and selective cyclohexyl-derived imidazopyrazine insulin-like growth factor 1 receptor inhibitors with in vivo efficacy. Bioorg Med Chem Lett21:1176-80 (2011) 
 
Insulin-like growth factor 1 receptor
Name:Insulin-like growth factor 1 receptor
Type:Protein
Mol. Mass.:154776.79
Organism:Homo sapiens (Human)
Description:P08069
Residue:1367
BDBM50336321
NameBDBM50336321
Synonyms:CHEMBL1667939 | trans-4-(8-amino-1-(8-fluoro-2-phenylquinolin-7-yl)imidazo[1,5-a]pyrazin-3-yl)-N-methylcyclohexanecarboxamide
TypeSmall organic molecule
Emp. Form.C29H27FN6O
Mol. Mass.494.5627
SMILESCNC(=O)[C@H]1CC[C@@H](CC1)c1nc(-c2ccc3ccc(nc3c2F)-c2ccccc2)c2c(N)nccn12