Reaction Details
TargetCytochrome P450 2D6
LigandBDBM50190520
Substrate/Competitorn/a
Meas. Tech.ChEMBL_716716 (CHEMBL1670541)
IC50 4600±n/a nM
Citation Nishizawa, RNishiyama, THisaichi, KMinamoto, CMatsunaga, NTakaoka, YNakai, HJenkinson, SKazmierski, WMTada, HSagawa, KShibayama, SFukushima, DMaeda, KMitsuya, H Spirodiketopiperazine-based CCR5 antagonist: discovery of an antiretroviral drug candidate. Bioorg Med Chem Lett21:1141-5 (2011) 
 
Cytochrome P450 2D6
Name:Cytochrome P450 2D6
Type:Protein
Mol. Mass.:55774.82
Organism:Homo sapiens (Human)
Description:P10635
Residue:497
BDBM50190520
NameBDBM50190520
Synonyms:(RS)-1-butyl-3-isobutyl-9-(4-phenoxybenzyl)-1,4,9-triazaspiro[5.5]undecane-2,5-dione hydrochloride 1-butyl-3-isobutyl-9-(4-phenoxy-benzyl)-1,4,9-triaza-spiro[5.5]undecane-2,5-dione hydrochloride rac-1-Butyl-3-isobutyl-9-(4-phenoxybenzyl)-1,4,9-triazaspiro[5.5]undecane-2,5-dione hydrochloride
TypeSmall organic molecule
Emp. Form.C29H39N3O3
Mol. Mass.477.6383
SMILESCCCCN1C(=O)C(CC(C)C)NC(=O)C11CCN(Cc2ccc(Oc3ccccc3)cc2)CC1