Reaction Details
TargetCytochrome P450 2D6
LigandBDBM50198936
Substrate/Competitorn/a
Meas. Tech.ChEMBL_716716 (CHEMBL1670541)
IC50 9800±n/a nM
Citation Nishizawa, RNishiyama, THisaichi, KMinamoto, CMatsunaga, NTakaoka, YNakai, HJenkinson, SKazmierski, WMTada, HSagawa, KShibayama, SFukushima, DMaeda, KMitsuya, H Spirodiketopiperazine-based CCR5 antagonist: discovery of an antiretroviral drug candidate. Bioorg Med Chem Lett21:1141-5 (2011) 
 
Cytochrome P450 2D6
Name:Cytochrome P450 2D6
Type:Protein
Mol. Mass.:55774.82
Organism:Homo sapiens (Human)
Description:P10635
Residue:497
BDBM50198936
NameBDBM50198936
Synonyms:(R)-1-butyl-3-((R)-cyclohexyl-hydroxy-methyl)-9-(4-phenoxy-benzyl)-1,4,9-triaza-spiro[5.5]undecane-2,5-dione hydrochloride | CHEMBL536754
TypeSmall organic molecule
Emp. Form.C32H43N3O4
Mol. Mass.533.7015
SMILESCCCCN1C(=O)[C@H](NC(=O)C11CCN(Cc2ccc(Oc3ccccc3)cc2)CC1)[C@H](O)C1CCCCC1