Reaction Details
TargetCytochrome P450 3A4
LigandBDBM50190516
Substrate/Competitorn/a
Meas. Tech.ChEMBL_716717 (CHEMBL1670542)
IC50 9300±n/a nM
Citation Nishizawa, RNishiyama, THisaichi, KMinamoto, CMatsunaga, NTakaoka, YNakai, HJenkinson, SKazmierski, WMTada, HSagawa, KShibayama, SFukushima, DMaeda, KMitsuya, H Spirodiketopiperazine-based CCR5 antagonist: discovery of an antiretroviral drug candidate. Bioorg Med Chem Lett21:1141-5 (2011) 
 
Cytochrome P450 3A4
Name:Cytochrome P450 3A4
Type:Enzyme
Mol. Mass.:57349.57
Organism:Homo sapiens (Human)
Description:n/a
Residue:503
BDBM50190516
NameBDBM50190516
Synonyms:(RS)-1-butyl-3-(cyclohexylmethyl)-9-(4-phenoxybenzyl)-1,4,9-triazaspiro[5.5]undecane-2,5-dione hydrochloride 1-butyl-3-cyclohexylmethyl-9-(4-phenoxyphenylmethyl)-1,4,9-triazaspiro[5.5]undeca-2,5-dione hydrochloride rac-1-Butyl-3-(cyclohexylmethyl)-9-(4-phenoxybenzyl)-1,4,9-triazaspiro[5.5]undecane-2,5-dione hydrochloride
TypeSmall organic molecule
Emp. Form.C32H43N3O3
Mol. Mass.517.7021
SMILESCCCCN1C(=O)C(CC2CCCCC2)NC(=O)C11CCN(Cc2ccc(Oc3ccccc3)cc2)CC1