Reaction Details
TargetCytochrome P450 3A4
LigandBDBM50336348
Substrate/Competitorn/a
Meas. Tech.ChEMBL_716717 (CHEMBL1670542)
IC50>30000±n/a nM
Citation Nishizawa, RNishiyama, THisaichi, KMinamoto, CMatsunaga, NTakaoka, YNakai, HJenkinson, SKazmierski, WMTada, HSagawa, KShibayama, SFukushima, DMaeda, KMitsuya, H Spirodiketopiperazine-based CCR5 antagonist: discovery of an antiretroviral drug candidate. Bioorg Med Chem Lett21:1141-5 (2011) 
 
Cytochrome P450 3A4
Name:Cytochrome P450 3A4
Type:Enzyme
Mol. Mass.:57349.57
Organism:Homo sapiens (Human)
Description:n/a
Residue:503
BDBM50336348
NameBDBM50336348
Synonyms:4-(4-(((S)-1-butyl-3-((S)-cyclohexyl(hydroxy)methyl)-2,5-dioxo-1,4,9-triazaspiro[5.5]undecan-9-yl)methyl)phenoxy)benzoic acid hydrochloride | CHEMBL1668022
TypeSmall organic molecule
Emp. Form.C33H43N3O6
Mol. Mass.577.711
SMILESCCCCN1C(=O)[C@@H](NC(=O)C11CCN(Cc2ccc(Oc3ccc(cc3)C(O)=O)cc2)CC1)[C@@H](O)C1CCCCC1