Reaction Details
TargetC-C chemokine receptor type 2
LigandBDBM50337608
Substrate/Competitorn/a
Meas. Tech.ChEMBL_728647 (CHEMBL1685777)
IC50 4.6±n/a nM
Citation Zheng, CCao, GXia, MFeng, HGlenn, JAnand, RZhang, KHuang, TWang, AKong, LLi, MGalya, LHughes, RODevraj, RMorton, PARogier, DJCovington, MBaribaud, FShin, NScherle, PDiamond, SYeleswaram, SVaddi, KNewton, RHollis, GFriedman, SMetcalf, BXue, CB Discovery of INCB10820/PF-4178903, a potent, selective, and orally bioavailable dual CCR2 and CCR5 antagonist. Bioorg Med Chem Lett21:1442-6 (2011) 
 
C-C chemokine receptor type 2
Name:C-C chemokine receptor type 2
Type:Enzyme
Mol. Mass.:41932.32
Organism:Homo sapiens (Human)
Description:P41597
Residue:374
BDBM50337608
NameBDBM50337608
Synonyms:CHEMBL1683063 | cis-((1S,3R)-3-(3-ethyl-tetrahydro-2H-pyran-4-ylamino)-1-isopropylcyclopentyl)(4-(3-(trifluoromethyl)phenyl)piperazin-1-yl)methanone
TypeSmall organic molecule
Emp. Form.C27H40F3N3O2
Mol. Mass.495.6206
SMILESCC[C@@H]1COCC[C@@H]1N[C@@H]1CC[C@](C1)(C(C)C)C(=O)N1CCN(CC1)c1cccc(c1)C(F)(F)F