Reaction Details
TargetProstaglandin E synthase
LigandBDBM50337659
Substrate/Competitorn/a
Meas. Tech.ChEMBL_728757 (CHEMBL1686170)
IC50 1±n/a nM
Citation Chiasson, JFBoulet, LBrideau, CChau, AClaveau, DCôté, BEthier, DGiroux, AGuay, JGuiral, SMancini, JMassé, FMéthot, NRiendeau, DRoy, PRubin, JXu, DYu, HDucharme, YFriesen, RW Trisubstituted ureas as potent and selective mPGES-1 inhibitors. Bioorg Med Chem Lett21:1488-92 (2011) 
 
Prostaglandin E synthase
Name:Prostaglandin E synthase
Type:Protein
Mol. Mass.:17112.22
Organism:Homo sapiens (Human)
Description:n/a
Residue:152
BDBM50337659
NameBDBM50337659
Synonyms:1-(3-((4-chlorophenyl)ethynyl)benzyl)-3-isopropyl-1-(3-(pyridin-3-ylethynyl)benzyl)urea | CHEMBL1683215
TypeSmall organic molecule
Emp. Form.C33H28ClN3O
Mol. Mass.518.048
SMILESCC(C)NC(=O)N(Cc1cccc(c1)C#Cc1ccc(Cl)cc1)Cc1cccc(c1)C#Cc1cccnc1