Reaction Details
TargetProstaglandin E synthase
LigandBDBM50337657
Substrate/Competitorn/a
Meas. Tech.ChEMBL_728757 (CHEMBL1686170)
IC50 2±n/a nM
Citation Chiasson, JFBoulet, LBrideau, CChau, AClaveau, DCôté, BEthier, DGiroux, AGuay, JGuiral, SMancini, JMassé, FMéthot, NRiendeau, DRoy, PRubin, JXu, DYu, HDucharme, YFriesen, RW Trisubstituted ureas as potent and selective mPGES-1 inhibitors. Bioorg Med Chem Lett21:1488-92 (2011) 
 
Prostaglandin E synthase
Name:Prostaglandin E synthase
Type:Protein
Mol. Mass.:17112.22
Organism:Homo sapiens (Human)
Description:n/a
Residue:152
BDBM50337657
NameBDBM50337657
Synonyms:3-isopropyl-1-(3-(phenylethynyl)benzyl)-1-((5-(phenylethynyl)pyridin-3-yl)methyl)urea | CHEMBL1683213
TypeSmall organic molecule
Emp. Form.C33H29N3O
Mol. Mass.483.6029
SMILESCC(C)NC(=O)N(Cc1cccc(c1)C#Cc1ccccc1)Cc1cncc(c1)C#Cc1ccccc1