Reaction Details
TargetProstaglandin E synthase
LigandBDBM50337642
Substrate/Competitorn/a
Meas. Tech.ChEMBL_728758 (CHEMBL1686171)
IC50 1300±n/a nM
Citation Chiasson, JFBoulet, LBrideau, CChau, AClaveau, DCôté, BEthier, DGiroux, AGuay, JGuiral, SMancini, JMassé, FMéthot, NRiendeau, DRoy, PRubin, JXu, DYu, HDucharme, YFriesen, RW Trisubstituted ureas as potent and selective mPGES-1 inhibitors. Bioorg Med Chem Lett21:1488-92 (2011) 
 
Prostaglandin E synthase
Name:Prostaglandin E synthase
Type:Protein
Mol. Mass.:17112.22
Organism:Homo sapiens (Human)
Description:n/a
Residue:152
BDBM50337642
NameBDBM50337642
Synonyms:1-benzyl-3-isopropyl-1-(3-((3-methoxyphenyl)ethynyl)benzyl)urea | CHEMBL1683199
TypeSmall organic molecule
Emp. Form.C27H28N2O2
Mol. Mass.412.5234
SMILESCOc1cccc(c1)C#Cc1cccc(CN(Cc2ccccc2)C(=O)NC(C)C)c1