Reaction Details
TargetProstaglandin E synthase
LigandBDBM50337669
Substrate/Competitorn/a
Meas. Tech.ChEMBL_728758 (CHEMBL1686171)
IC50 1600±n/a nM
Citation Chiasson, JFBoulet, LBrideau, CChau, AClaveau, DCôté, BEthier, DGiroux, AGuay, JGuiral, SMancini, JMassé, FMéthot, NRiendeau, DRoy, PRubin, JXu, DYu, HDucharme, YFriesen, RW Trisubstituted ureas as potent and selective mPGES-1 inhibitors. Bioorg Med Chem Lett21:1488-92 (2011) 
 
Prostaglandin E synthase
Name:Prostaglandin E synthase
Type:Protein
Mol. Mass.:17112.22
Organism:Homo sapiens (Human)
Description:n/a
Residue:152
BDBM50337669
NameBDBM50337669
Synonyms:1-benzyl-2-cyano-3-isopropyl-1-(3-(phenylethynyl)benzyl)guanidine | CHEMBL1683227
TypeSmall organic molecule
Emp. Form.C27H26N4
Mol. Mass.406.5221
SMILESCC(C)NC(=NC#N)N(Cc1ccccc1)Cc1cccc(c1)C#Cc1ccccc1