Reaction Details
TargetProstaglandin E synthase
LigandBDBM50337670
Substrate/Competitorn/a
Meas. Tech.ChEMBL_728757 (CHEMBL1686170)
IC50 43±n/a nM
Citation Chiasson, JFBoulet, LBrideau, CChau, AClaveau, DCôté, BEthier, DGiroux, AGuay, JGuiral, SMancini, JMassé, FMéthot, NRiendeau, DRoy, PRubin, JXu, DYu, HDucharme, YFriesen, RW Trisubstituted ureas as potent and selective mPGES-1 inhibitors. Bioorg Med Chem Lett21:1488-92 (2011) 
 
Prostaglandin E synthase
Name:Prostaglandin E synthase
Type:Protein
Mol. Mass.:17112.22
Organism:Homo sapiens (Human)
Description:n/a
Residue:152
BDBM50337670
NameBDBM50337670
Synonyms:1-benzyl-3-isopropyl-1-(3-(phenylethynyl)benzyl)thiourea | CHEMBL1683228
TypeSmall organic molecule
Emp. Form.C26H26N2S
Mol. Mass.398.563
SMILESCC(C)NC(=S)N(Cc1ccccc1)Cc1cccc(c1)C#Cc1ccccc1