Reaction Details
TargetBeta-lactamase
LigandBDBM50339858
Substrate/Competitorn/a
Meas. Tech.ChEMBL_740684 (CHEMBL1763746)
Ki 8400±n/a nM
Citation Xia, YCao, KZhou, YAlley, MRRock, FMohan, MMeewan, MBaker, SJLux, SDing, CZJia, GKully, MPlattner, JJ Synthesis and SAR of novel benzoxaboroles as a new class of β-lactamase inhibitors. Bioorg Med Chem Lett21:2533-6 (2011) 
 
Beta-lactamase
Name:Beta-lactamase
Type:PROTEIN
Mol. Mass.:41306.67
Organism:Enterobacter cloacae
Description:ChEMBL_40258
Residue:381
BDBM50339858
NameBDBM50339858
Synonyms:6-(3-(hydroxymethyl)phenoxy)benzo[c][1,2]oxaborol-1(3H)-ol | CHEMBL1761264
TypeSmall organic molecule
Emp. Form.C14H13BO4
Mol. Mass.256.062
SMILESOCc1cccc(Oc2ccc3COB(O)c3c2)c1