Reaction Details
TargetBeta-lactamase
LigandBDBM50339868
Substrate/Competitorn/a
Meas. Tech.ChEMBL_740684 (CHEMBL1763746)
Ki 20±n/a nM
Citation Xia, YCao, KZhou, YAlley, MRRock, FMohan, MMeewan, MBaker, SJLux, SDing, CZJia, GKully, MPlattner, JJ Synthesis and SAR of novel benzoxaboroles as a new class of β-lactamase inhibitors. Bioorg Med Chem Lett21:2533-6 (2011) 
 
Beta-lactamase
Name:Beta-lactamase
Type:PROTEIN
Mol. Mass.:41306.67
Organism:Enterobacter cloacae
Description:ChEMBL_40258
Residue:381
BDBM50339868
NameBDBM50339868
Synonyms:4-(1-hydroxy-1,3-dihydrobenzo[c][1,2]oxaborol-6-yloxy)benzoic acid | CHEMBL1761274
TypeSmall organic molecule
Emp. Form.C14H11BO5
Mol. Mass.270.045
SMILESOB1OCc2ccc(Oc3ccc(cc3)C(O)=O)cc12