Reaction Details
TargetEpidermal growth factor receptor
LigandBDBM50340121
Substrate/Competitorn/a
Meas. Tech.ChEMBL_741313 (CHEMBL1764782)
IC50 853±n/a nM
Citation Buchanan, JLNewcomb, JRCarney, DPChaffee, SCChai, LCupples, REpstein, LFGallant, PGu, YHarmange, JCHodge, KHouk, BEHuang, XJona, JJoseph, SJun, HTKumar, RLi, CLu, JMenges, TMorrison, MJNovak, PMvan der Plas, SRadinsky, RRose, PESawant, SSun, JRSurapaneni, STurci, SMXu, KYanez, EZhao, HZhu, X Discovery of 2,4-bis-arylamino-1,3-pyrimidines as insulin-like growth factor-1 receptor (IGF-1R) inhibitors. Bioorg Med Chem Lett21:2394-9 (2011) 
 
Epidermal growth factor receptor
Name:Epidermal growth factor receptor
Type:Receptor Kinase Domain
Mol. Mass.:134279.59
Organism:Homo sapiens (Human)
Description:P00533
Residue:1210
BDBM50340121
NameBDBM50340121
Synonyms:CHEMBL1760035 | N4-(quinolin-3-yl)-N2-(3,4,5-trimethoxyphenyl)pyrimidine-2,4-diamine
TypeSmall organic molecule
Emp. Form.C22H21N5O3
Mol. Mass.403.4338
SMILESCOc1cc(Nc2nccc(Nc3cnc4ccccc4c3)n2)cc(OC)c1OC