Reaction Details
TargetCannabinoid receptor 2
LigandBDBM50340996
Substrate/Competitorn/a
Meas. Tech.ChEMBL_740154 (CHEMBL1763214)
EC50 14850±n/a nM
Citation Riether, DWu, LCirillo, PFBerry, AWalker, ERErmann, MNoya-Marino, BJenkins, JEAlbaugh, DAlbrecht, CFisher, MGemkow, MJGrbic, HLöbbe, SMöller, CO'Shea, KSauer, AShih, DTThomson, DS 1,4-Diazepane compounds as potent and selective CB2 agonists: optimization of metabolic stability. Bioorg Med Chem Lett21:2011-6 (2011) 
 
Cannabinoid receptor 2
Name:Cannabinoid receptor 2
Type:G Protein-Coupled Receptor (GPCR)
Mol. Mass.:39690.94
Organism:Homo sapiens (Human)
Description:P34972
Residue:360
BDBM50340996
NameBDBM50340996
Synonyms:CHEMBL1762302 | N-(3-tert-butyl-1-methyl-1H-pyrazol-5-yl)-4-(tetrahydro-2H-pyran-4-carbonyl)-1,4-diazepane-1-carboxamide
TypeSmall organic molecule
Emp. Form.C20H33N5O3
Mol. Mass.391.5077
SMILESCn1nc(cc1NC(=O)N1CCCN(CC1)C(=O)C1CCOCC1)C(C)(C)C