Reaction Details
TargetCannabinoid receptor 1
LigandBDBM50340995
Substrate/Competitorn/a
Meas. Tech.ChEMBL_740155 (CHEMBL1763215)
EC50>20000±n/a nM
Citation Riether, DWu, LCirillo, PFBerry, AWalker, ERErmann, MNoya-Marino, BJenkins, JEAlbaugh, DAlbrecht, CFisher, MGemkow, MJGrbic, HLöbbe, SMöller, CO'Shea, KSauer, AShih, DTThomson, DS 1,4-Diazepane compounds as potent and selective CB2 agonists: optimization of metabolic stability. Bioorg Med Chem Lett21:2011-6 (2011) 
 
Cannabinoid receptor 1
Name:Cannabinoid receptor 1
Type:G Protein-Coupled Receptor (GPCR)
Mol. Mass.:52868.96
Organism:Homo sapiens (Human)
Description:P21554
Residue:472
BDBM50340995
NameBDBM50340995
Synonyms:CHEMBL1762301 | N-(4-phenylthiazol-2-yl)-4-(tetrahydro-2H-pyran-4-carbonyl)-1,4-diazepane-1-carboxamide
TypeSmall organic molecule
Emp. Form.C21H26N4O3S
Mol. Mass.414.521
SMILESO=C(Nc1nc(cs1)-c1ccccc1)N1CCCN(CC1)C(=O)C1CCOCC1