Reaction Details
TargetCannabinoid receptor 1
LigandBDBM50341005
Substrate/Competitorn/a
Meas. Tech.ChEMBL_740155 (CHEMBL1763215)
EC50>20000±n/a nM
Citation Riether, DWu, LCirillo, PFBerry, AWalker, ERErmann, MNoya-Marino, BJenkins, JEAlbaugh, DAlbrecht, CFisher, MGemkow, MJGrbic, HLöbbe, SMöller, CO'Shea, KSauer, AShih, DTThomson, DS 1,4-Diazepane compounds as potent and selective CB2 agonists: optimization of metabolic stability. Bioorg Med Chem Lett21:2011-6 (2011) 
 
Cannabinoid receptor 1
Name:Cannabinoid receptor 1
Type:G Protein-Coupled Receptor (GPCR)
Mol. Mass.:52868.96
Organism:Homo sapiens (Human)
Description:P21554
Residue:472
BDBM50341005
NameBDBM50341005
Synonyms:CHEMBL1762424 | N-(5-tert-butylisoxazol-3-yl)-4-(1-(methylsulfonyl)piperidine-4-carbonyl)-1,4-diazepane-1-carboxamide
TypeSmall organic molecule
Emp. Form.C20H33N5O5S
Mol. Mass.455.572
SMILESCC(C)(C)c1cc(NC(=O)N2CCCN(CC2)C(=O)C2CCN(CC2)S(C)(=O)=O)no1