Reaction Details
TargetCannabinoid receptor 2
LigandBDBM50341028
Substrate/Competitorn/a
Meas. Tech.ChEMBL_740154 (CHEMBL1763214)
EC50>20000±n/a nM
Citation Riether, DWu, LCirillo, PFBerry, AWalker, ERErmann, MNoya-Marino, BJenkins, JEAlbaugh, DAlbrecht, CFisher, MGemkow, MJGrbic, HLöbbe, SMöller, CO'Shea, KSauer, AShih, DTThomson, DS 1,4-Diazepane compounds as potent and selective CB2 agonists: optimization of metabolic stability. Bioorg Med Chem Lett21:2011-6 (2011) 
 
Cannabinoid receptor 2
Name:Cannabinoid receptor 2
Type:G Protein-Coupled Receptor (GPCR)
Mol. Mass.:39690.94
Organism:Homo sapiens (Human)
Description:P34972
Residue:360
BDBM50341028
NameBDBM50341028
Synonyms:4-(3-cyclopentylpropanoyl)-N-p-tolyl-1,4-diazepane-1-carboxamide | CHEMBL1762279
TypeSmall organic molecule
Emp. Form.C21H31N3O2
Mol. Mass.357.4897
SMILESCc1ccc(NC(=O)N2CCCN(CC2)C(=O)CCC2CCCC2)cc1