Reaction Details
TargetCannabinoid receptor 1
LigandBDBM50341029
Substrate/Competitorn/a
Meas. Tech.ChEMBL_740155 (CHEMBL1763215)
EC50>20000±n/a nM
Citation Riether, DWu, LCirillo, PFBerry, AWalker, ERErmann, MNoya-Marino, BJenkins, JEAlbaugh, DAlbrecht, CFisher, MGemkow, MJGrbic, HLöbbe, SMöller, CO'Shea, KSauer, AShih, DTThomson, DS 1,4-Diazepane compounds as potent and selective CB2 agonists: optimization of metabolic stability. Bioorg Med Chem Lett21:2011-6 (2011) 
 
Cannabinoid receptor 1
Name:Cannabinoid receptor 1
Type:G Protein-Coupled Receptor (GPCR)
Mol. Mass.:52868.96
Organism:Homo sapiens (Human)
Description:P21554
Residue:472
BDBM50341029
NameBDBM50341029
Synonyms:4-(3-cyclopentylpropanoyl)-N-phenyl-1,4-diazepane-1-carboxamide | CHEMBL1762278
TypeSmall organic molecule
Emp. Form.C20H29N3O2
Mol. Mass.343.4632
SMILESO=C(CCC1CCCC1)N1CCCN(CC1)C(=O)Nc1ccccc1