Reaction Details
TargetCannabinoid receptor 2
LigandBDBM50341026
Substrate/Competitorn/a
Meas. Tech.ChEMBL_740154 (CHEMBL1763214)
EC50 1940±n/a nM
Citation Riether, DWu, LCirillo, PFBerry, AWalker, ERErmann, MNoya-Marino, BJenkins, JEAlbaugh, DAlbrecht, CFisher, MGemkow, MJGrbic, HLöbbe, SMöller, CO'Shea, KSauer, AShih, DTThomson, DS 1,4-Diazepane compounds as potent and selective CB2 agonists: optimization of metabolic stability. Bioorg Med Chem Lett21:2011-6 (2011) 
 
Cannabinoid receptor 2
Name:Cannabinoid receptor 2
Type:G Protein-Coupled Receptor (GPCR)
Mol. Mass.:39690.94
Organism:Homo sapiens (Human)
Description:P34972
Residue:360
BDBM50341026
NameBDBM50341026
Synonyms:CHEMBL1762297 | N-(5-phenylisoxazol-3-yl)-4-(tetrahydro-2H-pyran-4-carbonyl)-1,4-diazepane-1-carboxamide
TypeSmall organic molecule
Emp. Form.C21H26N4O4
Mol. Mass.398.4555
SMILESO=C(Nc1cc(on1)-c1ccccc1)N1CCCN(CC1)C(=O)C1CCOCC1