Reaction Details
TargetCytochrome P450 3A4
LigandBDBM50341008
Substrate/Competitorn/a
Meas. Tech.ChEMBL_740159 (CHEMBL1763219)
IC50>30000±n/a nM
Citation Riether, DWu, LCirillo, PFBerry, AWalker, ERErmann, MNoya-Marino, BJenkins, JEAlbaugh, DAlbrecht, CFisher, MGemkow, MJGrbic, HLöbbe, SMöller, CO'Shea, KSauer, AShih, DTThomson, DS 1,4-Diazepane compounds as potent and selective CB2 agonists: optimization of metabolic stability. Bioorg Med Chem Lett21:2011-6 (2011) 
 
Cytochrome P450 3A4
Name:Cytochrome P450 3A4
Type:Enzyme
Mol. Mass.:57349.57
Organism:Homo sapiens (Human)
Description:n/a
Residue:503
BDBM50341008
NameBDBM50341008
Synonyms:4-[2-(1,1-Dioxo-1lambda*6*-thiomorpholin-4-yl)-acetyl]-[1,4]diazepane-1-carboxylic acid(5-tert-butyl-isoxazol-3-yl)-amide | CHEMBL1762427
TypeSmall organic molecule
Emp. Form.C19H31N5O5S
Mol. Mass.441.545
SMILESCC(C)(C)c1cc(NC(=O)N2CCCN(CC2)C(=O)CN2CCS(=O)(=O)CC2)no1