Reaction Details
TargetPhosphatidylinositol 4,5-bisphosphate 3-kinase catalytic subunit delta isoform
LigandBDBM50341056
Substrate/Competitorn/a
Meas. Tech.ChEMBL_739738 (CHEMBL1763564)
IC50 0.4±n/a nM
Citation Peterson, EAAndrews, PSBe, XBoezio, AABush, TLCheng, ACCoats, JRColletti, AECopeland, KWDuPont, MGraceffa, RGrubinska, BHarmange, JCKim, JLMullady, ELOlivieri, PSchenkel, LBStanton, MKTeffera, YWhittington, DACai, TLa, DS Discovery of triazine-benzimidazoles as selective inhibitors of mTOR. Bioorg Med Chem Lett21:2064-70 (2011) 
 
Phosphatidylinositol 4,5-bisphosphate 3-kinase catalytic subunit delta isoform
Name:Phosphatidylinositol 4,5-bisphosphate 3-kinase catalytic subunit delta isoform
Type:Enzyme Subunit
Mol. Mass.:119489.41
Organism:Homo sapiens (Human)
Description:O00329
Residue:1044
BDBM50341056
NameBDBM50341056
Synonyms:5-(1-(4-amino-6-methyl-1,3,5-triazin-2-yl)-1H-benzo[d]imidazol-2-ylamino)benzene-1,3-diol | CHEMBL1762790
TypeSmall organic molecule
Emp. Form.C17H15N7O2
Mol. Mass.349.3467
SMILESCc1nc(N)nc(n1)-n1c(Nc2cc(O)cc(O)c2)nc2ccccc12