Reaction Details
TargetSerine/threonine-protein kinase mTOR
LigandBDBM50341056
Substrate/Competitorn/a
Meas. Tech.ChEMBL_739654 (CHEMBL1763480)
IC50 0.2±n/a nM
Citation Peterson, EAAndrews, PSBe, XBoezio, AABush, TLCheng, ACCoats, JRColletti, AECopeland, KWDuPont, MGraceffa, RGrubinska, BHarmange, JCKim, JLMullady, ELOlivieri, PSchenkel, LBStanton, MKTeffera, YWhittington, DACai, TLa, DS Discovery of triazine-benzimidazoles as selective inhibitors of mTOR. Bioorg Med Chem Lett21:2064-70 (2011) 
 
Serine/threonine-protein kinase mTOR
Name:Serine/threonine-protein kinase mTOR
Type:Rapamycin target protein
Mol. Mass.:288917.12
Organism:Homo sapiens (Human)
Description:P42345
Residue:2549
BDBM50341056
NameBDBM50341056
Synonyms:5-(1-(4-amino-6-methyl-1,3,5-triazin-2-yl)-1H-benzo[d]imidazol-2-ylamino)benzene-1,3-diol | CHEMBL1762790
TypeSmall organic molecule
Emp. Form.C17H15N7O2
Mol. Mass.349.3467
SMILESCc1nc(N)nc(n1)-n1c(Nc2cc(O)cc(O)c2)nc2ccccc12