Reaction Details
TargetInterstitial collagenase
LigandBDBM50311088
Substrate/Competitorn/a
Meas. Tech.ChEMBL_743596 (CHEMBL1768096)
IC50 180±n/a nM
Citation Shiozaki, MMaeda, KMiura, TKotoku, MYamasaki, TMatsuda, IAoki, KYasue, KImai, HUbukata, MSuma, AYokota, MHotta, TTanaka, MHase, YHaas, JFryer, AMLaird, ERLittmann, NMAndrews, SWJosey, JAMimura, TShinozaki, YYoshiuchi, HInaba, T Discovery of (1S,2R,3R)-2,3-dimethyl-2-phenyl-1-sulfamidocyclopropanecarboxylates: novel and highly selective aggrecanase inhibitors. J Med Chem54:2839-63 (2011) 
 
Interstitial collagenase
Name:Interstitial collagenase
Type:Enzyme
Mol. Mass.:54010.26
Organism:Homo sapiens (Human)
Description: P03956
Residue:469
BDBM50311088
NameBDBM50311088
Synonyms:CHEMBL1078281 | cis-rac-1-(5-(4-chloro-1H-pyrazol-1-yl)thiophene-2-sulfonamido)-2-methyl-3-phenylcyclopropanecarboxylic acid
TypeSmall organic molecule
Emp. Form.C18H16ClN3O4S2
Mol. Mass.437.92
SMILESC[C@@H]1[C@H](c2ccccc2)[C@]1(NS(=O)(=O)c1ccc(s1)-n1cc(Cl)cn1)C(O)=O