Reaction Details
TargetMitogen-activated protein kinase 11
LigandBDBM50348880
Substrate/Competitorn/a
Meas. Tech.ChEMBL_758423 (CHEMBL1811289)
IC50 19±n/a nM
Citation Dyckman, AJLi, TPitt, SZhang, RShen, DRMcIntyre, KWGillooly, KMShuster, DJDoweyko, AMSack, JSKish, KKiefer, SENewitt, JAZhang, HMarathe, PHMcKinnon, MBarrish, JCDodd, JHSchieven, GLLeftheris, K Discovery of pyrrolo[2,1-f][1,2,4]triazine C6-ketones as potent, orally active p38a MAP kinase inhibitors. Bioorg Med Chem Lett21:4633-7 (2011) 
 
Mitogen-activated protein kinase 11
Name:Mitogen-activated protein kinase 11
Type:Enzyme Catalytic Domain
Mol. Mass.:41351.73
Organism:Homo sapiens (Human)
Description:gi_20128774
Residue:364
BDBM50348880
NameBDBM50348880
Synonyms:CHEMBL1807446
TypeSmall organic molecule
Emp. Form.C25H23N5O2
Mol. Mass.425.4824
SMILESCc1c(cn2ncnc(Nc3cc(ccc3C)C(=O)NC3CC3)c12)C(=O)c1ccccc1