Reaction Details
TargetAurora kinase B
LigandBDBM50352307
Substrate/Competitorn/a
Meas. Tech.ChEMBL_766653 (CHEMBL1827219)
Kd 4±n/a nM
Citation Abraham, SHadd, MJTran, LVickers, TSindac, JMilanov, ZVHolladay, MWBhagwat, SSHua, HFord Pulido, JMCramer, MDGitnick, DJames, JDao, ABelli, BArmstrong, RCTreiber, DKLiu, G Novel series of pyrrolotriazine analogs as highly potent pan-Aurora kinase inhibitors. Bioorg Med Chem Lett21:5296-300 (2011) 
 
Aurora kinase B
Name:Aurora kinase B
Type:Protein
Mol. Mass.:39327.72
Organism:Homo sapiens (Human)
Description:Q96GD4
Residue:344
BDBM50352307
NameBDBM50352307
Synonyms:CHEMBL1822640
TypeSmall organic molecule
Emp. Form.C23H25FN8O2S
Mol. Mass.496.56
SMILESCc1cc(Nc2nc(Sc3ccc(NC(=O)CN4C[C@@H](F)C[C@H]4CO)cc3)nn3cccc23)n[nH]1