Reaction Details
TargetAurora kinase B
LigandBDBM50352300
Substrate/Competitorn/a
Meas. Tech.ChEMBL_766655 (CHEMBL1827221)
IC50 420±n/a nM
Citation Abraham, SHadd, MJTran, LVickers, TSindac, JMilanov, ZVHolladay, MWBhagwat, SSHua, HFord Pulido, JMCramer, MDGitnick, DJames, JDao, ABelli, BArmstrong, RCTreiber, DKLiu, G Novel series of pyrrolotriazine analogs as highly potent pan-Aurora kinase inhibitors. Bioorg Med Chem Lett21:5296-300 (2011) 
 
Aurora kinase B
Name:Aurora kinase B
Type:Protein
Mol. Mass.:39327.72
Organism:Homo sapiens (Human)
Description:Q96GD4
Residue:344
BDBM50352300
NameBDBM50352300
Synonyms:CHEMBL1822487
TypeSmall organic molecule
Emp. Form.C26H29N9O3S
Mol. Mass.547.632
SMILESCc1cc(Nc2nc(Sc3ccc(NC(=O)C4CC4)cc3)nn3cc(NC(=O)CN4CCOCC4)cc23)[nH]n1