Reaction Details
TargetAurora kinase B
LigandBDBM50352303
Substrate/Competitorn/a
Meas. Tech.ChEMBL_766653 (CHEMBL1827219)
Kd 4±n/a nM
Citation Abraham, SHadd, MJTran, LVickers, TSindac, JMilanov, ZVHolladay, MWBhagwat, SSHua, HFord Pulido, JMCramer, MDGitnick, DJames, JDao, ABelli, BArmstrong, RCTreiber, DKLiu, G Novel series of pyrrolotriazine analogs as highly potent pan-Aurora kinase inhibitors. Bioorg Med Chem Lett21:5296-300 (2011) 
 
Aurora kinase B
Name:Aurora kinase B
Type:Protein
Mol. Mass.:39327.72
Organism:Homo sapiens (Human)
Description:Q96GD4
Residue:344
BDBM50352303
NameBDBM50352303
Synonyms:CHEMBL1822490
TypeSmall organic molecule
Emp. Form.C27H30N10O3S
Mol. Mass.574.657
SMILESCN1CCN(CC1)C(=O)C(=O)Nc1cc2c(Nc3cc(C)n[nH]3)nc(Sc3ccc(NC(=O)C4CC4)cc3)nn2c1