Reaction Details
TargetAurora kinase B
LigandBDBM50352299
Substrate/Competitorn/a
Meas. Tech.ChEMBL_766655 (CHEMBL1827221)
IC50 850±n/a nM
Citation Abraham, SHadd, MJTran, LVickers, TSindac, JMilanov, ZVHolladay, MWBhagwat, SSHua, HFord Pulido, JMCramer, MDGitnick, DJames, JDao, ABelli, BArmstrong, RCTreiber, DKLiu, G Novel series of pyrrolotriazine analogs as highly potent pan-Aurora kinase inhibitors. Bioorg Med Chem Lett21:5296-300 (2011) 
 
Aurora kinase B
Name:Aurora kinase B
Type:Protein
Mol. Mass.:39327.72
Organism:Homo sapiens (Human)
Description:Q96GD4
Residue:344
BDBM50352299
NameBDBM50352299
Synonyms:CHEMBL1822486
TypeSmall organic molecule
Emp. Form.C28H33N9O2S
Mol. Mass.559.686
SMILESCc1cc(Nc2nc(Sc3ccc(NC(=O)C4CC4)cc3)nn3cc(NC(=O)CCN4CCCCC4)cc23)[nH]n1