Reaction Details
TargetAurora kinase C
LigandBDBM50352299
Substrate/Competitorn/a
Meas. Tech.ChEMBL_766654 (CHEMBL1827220)
Kd 10±n/a nM
Citation Abraham, SHadd, MJTran, LVickers, TSindac, JMilanov, ZVHolladay, MWBhagwat, SSHua, HFord Pulido, JMCramer, MDGitnick, DJames, JDao, ABelli, BArmstrong, RCTreiber, DKLiu, G Novel series of pyrrolotriazine analogs as highly potent pan-Aurora kinase inhibitors. Bioorg Med Chem Lett21:5296-300 (2011) 
 
Aurora kinase C
Name:Aurora kinase C
Type:Enzyme
Mol. Mass.:35602.43
Organism:Homo sapiens (Human)
Description:Amino acid residues 1-309 were expressed as His-tagged fusion protein using baculovirus expression system.
Residue:309
BDBM50352299
NameBDBM50352299
Synonyms:CHEMBL1822486
TypeSmall organic molecule
Emp. Form.C28H33N9O2S
Mol. Mass.559.686
SMILESCc1cc(Nc2nc(Sc3ccc(NC(=O)C4CC4)cc3)nn3cc(NC(=O)CCN4CCCCC4)cc23)[nH]n1