Reaction Details
TargetAurora kinase A
LigandBDBM50352302
Substrate/Competitorn/a
Meas. Tech.ChEMBL_766652 (CHEMBL1827218)
Kd 10±n/a nM
Citation Abraham, SHadd, MJTran, LVickers, TSindac, JMilanov, ZVHolladay, MWBhagwat, SSHua, HFord Pulido, JMCramer, MDGitnick, DJames, JDao, ABelli, BArmstrong, RCTreiber, DKLiu, G Novel series of pyrrolotriazine analogs as highly potent pan-Aurora kinase inhibitors. Bioorg Med Chem Lett21:5296-300 (2011) 
 
Aurora kinase A
Name:Aurora kinase A
Type:Serine/threonine-protein kinase
Mol. Mass.:45830.98
Organism:Homo sapiens (Human)
Description:O14965
Residue:403
BDBM50352302
NameBDBM50352302
Synonyms:CHEMBL1822489
TypeSmall organic molecule
Emp. Form.C27H31N9O3S
Mol. Mass.561.659
SMILESCc1cc(Nc2nc(Sc3ccc(NC(=O)C4CC4)cc3)nn3cc(NC(=O)CN4CCC[C@@H]4CO)cc23)[nH]n1