Reaction Details
TargetAurora kinase A
LigandBDBM50352304
Substrate/Competitorn/a
Meas. Tech.ChEMBL_766652 (CHEMBL1827218)
Kd 301±n/a nM
Citation Abraham, SHadd, MJTran, LVickers, TSindac, JMilanov, ZVHolladay, MWBhagwat, SSHua, HFord Pulido, JMCramer, MDGitnick, DJames, JDao, ABelli, BArmstrong, RCTreiber, DKLiu, G Novel series of pyrrolotriazine analogs as highly potent pan-Aurora kinase inhibitors. Bioorg Med Chem Lett21:5296-300 (2011) 
 
Aurora kinase A
Name:Aurora kinase A
Type:Serine/threonine-protein kinase
Mol. Mass.:45830.98
Organism:Homo sapiens (Human)
Description:O14965
Residue:403
BDBM50352304
NameBDBM50352304
Synonyms:CHEMBL1822643
TypeSmall organic molecule
Emp. Form.C27H34N8O3S
Mol. Mass.550.676
SMILESCc1cc(Nc2nc(Sc3ccc(NC(=O)CN4C[C@@H](C[C@@H]4CO)OC(C)(C)C)cc3)nn3cccc23)n[nH]1