Reaction Details
TargetAurora kinase A
LigandBDBM50352324
Substrate/Competitorn/a
Meas. Tech.ChEMBL_766652 (CHEMBL1827218)
Kd 8±n/a nM
Citation Abraham, SHadd, MJTran, LVickers, TSindac, JMilanov, ZVHolladay, MWBhagwat, SSHua, HFord Pulido, JMCramer, MDGitnick, DJames, JDao, ABelli, BArmstrong, RCTreiber, DKLiu, G Novel series of pyrrolotriazine analogs as highly potent pan-Aurora kinase inhibitors. Bioorg Med Chem Lett21:5296-300 (2011) 
 
Aurora kinase A
Name:Aurora kinase A
Type:Serine/threonine-protein kinase
Mol. Mass.:45830.98
Organism:Homo sapiens (Human)
Description:O14965
Residue:403
BDBM50352324
NameBDBM50352324
Synonyms:CHEMBL1822652
TypeSmall organic molecule
Emp. Form.C25H30N8O3S
Mol. Mass.522.622
SMILESCC(C)O[C@H]1CN(CC(=O)Nc2ccc(Sc3nc(Nc4cc(C)[nH]n4)c4cccn4n3)cc2)C[C@@H]1O