Reaction Details
TargetAurora kinase A
LigandBDBM50352330
Substrate/Competitorn/a
Meas. Tech.ChEMBL_766652 (CHEMBL1827218)
Kd 381±n/a nM
Citation Abraham, SHadd, MJTran, LVickers, TSindac, JMilanov, ZVHolladay, MWBhagwat, SSHua, HFord Pulido, JMCramer, MDGitnick, DJames, JDao, ABelli, BArmstrong, RCTreiber, DKLiu, G Novel series of pyrrolotriazine analogs as highly potent pan-Aurora kinase inhibitors. Bioorg Med Chem Lett21:5296-300 (2011) 
 
Aurora kinase A
Name:Aurora kinase A
Type:Serine/threonine-protein kinase
Mol. Mass.:45830.98
Organism:Homo sapiens (Human)
Description:O14965
Residue:403
BDBM50352330
NameBDBM50352330
Synonyms:CHEMBL1822646
TypeSmall organic molecule
Emp. Form.C23H27N9O2S
Mol. Mass.493.585
SMILESCc1cc(Nc2nc(Sc3ccc(NC(=O)CN4C[C@H](N)C[C@H]4CO)cc3)nn3cccc23)n[nH]1