Reaction Details
TargetHepatocyte growth factor receptor
LigandBDBM50352523
Substrate/Competitorn/a
Meas. Tech.ChEMBL_767236 (CHEMBL1826482)
IC50>10000±n/a nM
Citation Cui, JJTran-Dubé, MShen, HNambu, MKung, PPPairish, MJia, LMeng, JFunk, LBotrous, IMcTigue, MGrodsky, NRyan, KPadrique, EAlton, GTimofeevski, SYamazaki, SLi, QZou, HChristensen, JMroczkowski, BBender, SKania, RSEdwards, MP Structure based drug design of crizotinib (PF-02341066), a potent and selective dual inhibitor of mesenchymal-epithelial transition factor (c-MET) kinase and anaplastic lymphoma kinase (ALK). J Med Chem54:6342-63 (2011) 
 
Hepatocyte growth factor receptor
Name:Hepatocyte growth factor receptor
Type:Protein
Mol. Mass.:155559.73
Organism:Homo sapiens (Human)
Description:P08581
Residue:1390
BDBM50352523
NameBDBM50352523
Synonyms:CHEMBL1824867
TypeSmall organic molecule
Emp. Form.C28H32N4O2
Mol. Mass.456.5793
SMILESNc1ncc(cc1OCc1ccccc1)-c1ccc(cc1)C(=O)N1CCC[C@@H]1CN1CCCC1