Reaction Details
TargetHepatocyte growth factor receptor
LigandBDBM50352525
Substrate/Competitorn/a
Meas. Tech.ChEMBL_767236 (CHEMBL1826482)
IC50 5850±n/a nM
Citation Cui, JJTran-Dubé, MShen, HNambu, MKung, PPPairish, MJia, LMeng, JFunk, LBotrous, IMcTigue, MGrodsky, NRyan, KPadrique, EAlton, GTimofeevski, SYamazaki, SLi, QZou, HChristensen, JMroczkowski, BBender, SKania, RSEdwards, MP Structure based drug design of crizotinib (PF-02341066), a potent and selective dual inhibitor of mesenchymal-epithelial transition factor (c-MET) kinase and anaplastic lymphoma kinase (ALK). J Med Chem54:6342-63 (2011) 
 
Hepatocyte growth factor receptor
Name:Hepatocyte growth factor receptor
Type:Protein
Mol. Mass.:155559.73
Organism:Homo sapiens (Human)
Description:P08581
Residue:1390
BDBM50352525
NameBDBM50352525
Synonyms:CHEMBL1824869
TypeSmall organic molecule
Emp. Form.C28H31ClN4O2
Mol. Mass.491.024
SMILESNc1ncc(cc1OCc1ccccc1Cl)-c1ccc(cc1)C(=O)N1CCC[C@@H]1CN1CCCC1