Reaction Details
TargetHepatocyte growth factor receptor
LigandBDBM50352533
Substrate/Competitorn/a
Meas. Tech.ChEMBL_767236 (CHEMBL1826482)
IC50 140±n/a nM
Citation Cui, JJTran-Dubé, MShen, HNambu, MKung, PPPairish, MJia, LMeng, JFunk, LBotrous, IMcTigue, MGrodsky, NRyan, KPadrique, EAlton, GTimofeevski, SYamazaki, SLi, QZou, HChristensen, JMroczkowski, BBender, SKania, RSEdwards, MP Structure based drug design of crizotinib (PF-02341066), a potent and selective dual inhibitor of mesenchymal-epithelial transition factor (c-MET) kinase and anaplastic lymphoma kinase (ALK). J Med Chem54:6342-63 (2011) 
 
Hepatocyte growth factor receptor
Name:Hepatocyte growth factor receptor
Type:Protein
Mol. Mass.:155559.73
Organism:Homo sapiens (Human)
Description:P08581
Residue:1390
BDBM50352533
NameBDBM50352533
Synonyms:CHEMBL1824877
TypeSmall organic molecule
Emp. Form.C29H32Cl2N4O2
Mol. Mass.539.496
SMILESCC(Oc1cc(cnc1N)-c1ccc(cc1)C(=O)N1CCC[C@@H]1CN1CCCC1)c1c(Cl)cccc1Cl