Reaction Details
TargetHepatocyte growth factor receptor
LigandBDBM50352535
Substrate/Competitorn/a
Meas. Tech.ChEMBL_767236 (CHEMBL1826482)
IC50 7120±n/a nM
Citation Cui, JJTran-Dubé, MShen, HNambu, MKung, PPPairish, MJia, LMeng, JFunk, LBotrous, IMcTigue, MGrodsky, NRyan, KPadrique, EAlton, GTimofeevski, SYamazaki, SLi, QZou, HChristensen, JMroczkowski, BBender, SKania, RSEdwards, MP Structure based drug design of crizotinib (PF-02341066), a potent and selective dual inhibitor of mesenchymal-epithelial transition factor (c-MET) kinase and anaplastic lymphoma kinase (ALK). J Med Chem54:6342-63 (2011) 
 
Hepatocyte growth factor receptor
Name:Hepatocyte growth factor receptor
Type:Protein
Mol. Mass.:155559.73
Organism:Homo sapiens (Human)
Description:P08581
Residue:1390
BDBM50352535
NameBDBM50352535
Synonyms:CHEMBL1824879
TypeSmall organic molecule
Emp. Form.C13H11Cl2FN2O
Mol. Mass.301.144
SMILESCC(Oc1cccnc1N)c1c(Cl)ccc(F)c1Cl