Reaction Details
TargetHepatocyte growth factor receptor
LigandBDBM50352559
Substrate/Competitorn/a
Meas. Tech.ChEMBL_767240 (CHEMBL1825352)
Ki 14±n/a nM
Citation Cui, JJTran-Dubé, MShen, HNambu, MKung, PPPairish, MJia, LMeng, JFunk, LBotrous, IMcTigue, MGrodsky, NRyan, KPadrique, EAlton, GTimofeevski, SYamazaki, SLi, QZou, HChristensen, JMroczkowski, BBender, SKania, RSEdwards, MP Structure based drug design of crizotinib (PF-02341066), a potent and selective dual inhibitor of mesenchymal-epithelial transition factor (c-MET) kinase and anaplastic lymphoma kinase (ALK). J Med Chem54:6342-63 (2011) 
 
Hepatocyte growth factor receptor
Name:Hepatocyte growth factor receptor
Type:Protein
Mol. Mass.:155559.73
Organism:Homo sapiens (Human)
Description:P08581
Residue:1390
BDBM50352559
NameBDBM50352559
Synonyms:CHEMBL1825136
TypeSmall organic molecule
Emp. Form.C21H22Cl2FN5O
Mol. Mass.450.337
SMILESCC(Oc1cc(cnc1N)-c1cnn(c1)C1CCCNC1)c1c(Cl)ccc(F)c1Cl