Reaction Details
TargetRAF proto-oncogene serine/threonine-protein kinase
LigandBDBM50344664
Substrate/Competitorn/a
Meas. Tech.ChEMBL_766955 (CHEMBL1828180)
IC50>50000±n/a nM
Citation Kinoshita, KKobayashi, TAsoh, KFuruichi, NIto, TKawada, HHara, SOhwada, JHattori, KMiyagi, THong, WSPark, MJTakanashi, KTsukaguchi, TSakamoto, HTsukuda, TOikawa, N 9-substituted 6,6-dimethyl-11-oxo-6,11-dihydro-5H-benzo[b]carbazoles as highly selective and potent anaplastic lymphoma kinase inhibitors. J Med Chem54:6286-94 (2011) 
 
RAF proto-oncogene serine/threonine-protein kinase
Name:RAF proto-oncogene serine/threonine-protein kinase
Type:Serine/threonine-protein kinase
Mol. Mass.:73082.52
Organism:Homo sapiens (Human)
Description:P04049
Residue:648
BDBM50344664
NameBDBM50344664
Synonyms:6,6-dimethyl-8-(1-(oxetan-3-yl)piperidin-4-yl)-11-oxo-6,11-dihydro-5H-benzo[b]carbazole-3-carbonitrile US9126931, 178
TypeSmall organic molecule
Emp. Form.C27H27N3O2
Mol. Mass.425.5222
SMILESCC1(C)c2[nH]c3cc(ccc3c2C(=O)c2ccc(cc12)C1CCN(CC1)C1COC1)C#N