Reaction Details
TargetHepatocyte growth factor receptor
LigandBDBM50352764
Substrate/Competitorn/a
Meas. Tech.ChEMBL_766968 (CHEMBL1828295)
IC50>5000±n/a nM
Citation Kinoshita, KKobayashi, TAsoh, KFuruichi, NIto, TKawada, HHara, SOhwada, JHattori, KMiyagi, THong, WSPark, MJTakanashi, KTsukaguchi, TSakamoto, HTsukuda, TOikawa, N 9-substituted 6,6-dimethyl-11-oxo-6,11-dihydro-5H-benzo[b]carbazoles as highly selective and potent anaplastic lymphoma kinase inhibitors. J Med Chem54:6286-94 (2011) 
 
Hepatocyte growth factor receptor
Name:Hepatocyte growth factor receptor
Type:Protein
Mol. Mass.:155559.73
Organism:Homo sapiens (Human)
Description:P08581
Residue:1390
BDBM50352764
NameBDBM50352764
Synonyms:CHEMBL1823220
TypeSmall organic molecule
Emp. Form.C28H26N4O2
Mol. Mass.450.5316
SMILESCC1(C)c2[nH]c3cc(ccc3c2C(=O)c2cc(C#C)c(cc12)N1CCN(CC1)C1COC1)C#N