Reaction Details
TargetMast/stem cell growth factor receptor Kit
LigandBDBM50352761
Substrate/Competitorn/a
Meas. Tech.ChEMBL_766969 (CHEMBL1828296)
IC50>5000±n/a nM
Citation Kinoshita, KKobayashi, TAsoh, KFuruichi, NIto, TKawada, HHara, SOhwada, JHattori, KMiyagi, THong, WSPark, MJTakanashi, KTsukaguchi, TSakamoto, HTsukuda, TOikawa, N 9-substituted 6,6-dimethyl-11-oxo-6,11-dihydro-5H-benzo[b]carbazoles as highly selective and potent anaplastic lymphoma kinase inhibitors. J Med Chem54:6286-94 (2011) 
 
Mast/stem cell growth factor receptor Kit
Name:Mast/stem cell growth factor receptor Kit
Type:Protein
Mol. Mass.:109869.37
Organism:Homo sapiens (Human)
Description:P10721
Residue:976
BDBM50352761
NameBDBM50352761
Synonyms:CHEMBL1823361 | US9126931, 353
TypeSmall organic molecule
Emp. Form.C33H38N4O2
Mol. Mass.522.6804
SMILESCC1(C)c2[nH]c3cc(ccc3c2C(=O)c2cc(CCC3CCCC3)c(cc12)N1CCN(CC1)C1COC1)C#N