Reaction Details
TargetMelanin-concentrating hormone receptor 1
LigandBDBM50353451
Substrate/Competitorn/a
Meas. Tech.ChEMBL_768152 (CHEMBL1833190)
Ki 11±n/a nM
Citation Lu, KJiang, YChen, BEldemenky, EMMa, GPackiarajan, MChandrasena, GWhite, ADJones, KALi, BHong, SP Strategies to lower the Pgp efflux liability in a series of potent indole azetidine MCHR1 antagonists. Bioorg Med Chem Lett21:5310-4 (2011) 
 
Melanin-concentrating hormone receptor 1
Name:Melanin-concentrating hormone receptor 1
Type:Enzyme Catalytic Domain
Mol. Mass.:39075.64
Organism:RAT
Description:Melanin Concentrating Hormone 1 GPR24 RAT::P97639
Residue:353
BDBM50353451
NameBDBM50353451
Synonyms:CHEMBL1830045
TypeSmall organic molecule
Emp. Form.C25H25N3O2
Mol. Mass.399.4849
SMILESCN1CC(C1)c1cn(C)c2cc(ccc12)-n1ccc(OCc2ccccc2)cc1=O